Komutun çıktısıx[member=226]acer[/member]-AO725 ~ $ sudo apt-get install --reinstall mt7601-sta-dkms
[sudo] password for x:
Paket listeleri okunuyor... Bitti
Bağımlılık ağacı oluşturuluyor
Durum bilgisi okunuyor... Bitti
0 paket yükseltilecek, 0 yeni paket kurulacak, 1 paket yeniden kurulacak, 0 paket kaldırılacak ve 22 paket yükseltilmeyecek.
0 B/928 kB arşiv dosyası indirilecek.
Bu işlem tamamlandıktan sonra 0 B ek disk alanı kullanılacak.
(Veritabanı okunuyor... mevcut 163973 dosya veya klasör yüklü.)
Açılmaya hazırlanan .../mt7601-sta-dkms_3.0.0.4-0~201510061531~rev24~pkg4~ubuntu14.04.1_all.deb ...
------------------------------
Deleting module version: 3.0.0.4
completely from the DKMS tree.
------------------------------
Done.
mt7601-sta-dkms (3.0.0.4-0~201510061531~rev24~pkg4~ubuntu14.04.1) paketi (3.0.0.4-0~201510061531~rev24~pkg4~ubuntu14.04.1) üzerine açılıyor ...
mt7601-sta-dkms (3.0.0.4-0~201510061531~rev24~pkg4~ubuntu14.04.1) ayarlanıyor...
Loading new mt7601-3.0.0.4 DKMS files...
First Installation: checking all kernels...
Building only for 3.16.0-38-generic
Building for architecture i386
Building initial module for 3.16.0-38-generic
Error! Bad return status for module build on kernel: 3.16.0-38-generic (i386)
Consult /var/lib/dkms/mt7601/3.0.0.4/build/make.log for more information.
x[member=226]acer[/member]-AO725 ~ $
/var/lib/dkms/mt7601/3.0.0.4/build/make.log verileri aşağıdaki gibidir.
DKMS make.log for mt7601-3.0.0.4 for kernel 3.16.0-38-generic (i386)
Cum Oca 22 10:53:27 EET 2016
make -C tools
make[1]:`/var/lib/dkms/mt7601/3.0.0.4/build/tools' dizinine giriliyor
gcc -g bin2h.c -o bin2h
bin2h.c:28:19: fatal error: stdio.h: Böyle bir dosya ya da dizin yok
#include <stdio.h>
^
compilation terminated.
make[1]: *** [all] Hata 1
make[1]: `/var/lib/dkms/mt7601/3.0.0.4/build/tools' dizininden çıkılıyor
make: *** [build_tools] Hata 2